Bolesławiec
type: Concept
alternative label: Bunzlau, Buntzlau @de
alternative label: Boleslavia
definition: Miasto w Polsce, w województwie dolnośląskim, siedziba powiatu bolesławieckiego, historycznie leżące na Dolnym Śląsku. Przez miasto przepływa rzeka Bóbr, okoliczne obszary leśne należą do Borów Dolnośląskich.
in scheme: keywordsVocabulary